SOUNDERS
type: Concept
in scheme: instruments
definition: SOUNDERS are instruments that acquire multispectral measurements from which vertical profiles of atmospheric temperature and humidity can be derived.

Profilers/Sounders
type: Concept