M - O
type: Concept

NACP-MASEK-01
type: Concept
in scheme: projects
definition: A Community-Driven, North American Disturbance Record and Processing System for Land Satellite Data NACP Project Profile http://www.nacarbon.org/cgi-nacp/web/investigations/inv_pgp.pl?pgid=210 http://www.nacarbon.org/cgi-nacp/web/investigations/inv_pgp.pl?pgid=210