AU/QLD/NWR
type: Concept
change note: 2020-07-10 16:58:24.0 [sritz] update AltLabel (Department of Natural Resources, Mines and Energy, Queensland, Australia); update Resource (provider); update Resource (https://www.dnrme.qld.gov.au/);
in scheme: providers
definition: The vision of the Department of Natural Resources and Water (NRW) is managing Queensland's natural resources for today and tomorrow. NRW plays a critical role in the stewardship of Queensland's natural resources. The department manages and allocates the state's land and water resources, and manages native vegetation and the use and sale of native forest resources. Summary Provided By: http://www.nrw.qld.gov.au/about/index.html

AUSTRALIA
type: Concept