COASTAL
type: Concept

LAGOON
type: Concept
change note: 2016-06-13 13:50:18.0 [gee-cee] insert Definition (id: null text: Pertaining to shallow bodies of water partially or completely separated from the open ocean by barriers of sand or coral. language code: en);
change note: 2016-06-13 13:49:56.0 [gee-cee] Insert Concept add broader relation (LAGOON [879d286b-9ea6-4e4d-bdd1-56a4c7ca1531,188223] - COASTAL HABITAT [47be68db-d10d-43e7-b150-61cfd3f06126,84259]);
in scheme: sciencekeywords
definition: Pertaining to shallow bodies of water partially or completely separated from the open ocean by barriers of sand or coral.