Jet
type: Concept

NSF/NCAR GV HIAPER
type: Concept
definition: The NSF/NCAR High-performance Instrumented Airborne Platform for Environmental Research (HIAPER) aircraft is the preeminent airborne research platform for scientists and researchers in several disciplines. HIAPER has demonstrated success in collecting data required to meet a broad range of scientific studies and objectives, including air quality and chemistry; chemical composition and transport within the atmosphere; effects of the chemical process on climate change; atmospheric dynamics and thermodynamics on the synoptic and mesoscales; cloud properties and processes; atmospheric predictability; geological surveys; and electrification of the atmosphere. In support of university-driven observational field campaigns, HIAPER is maintained and operated on behalf of the National Science Foundation by the National Center for Atmospheric Research. HIAPER is based in Broomfield, Colorado, USA, and is managed by EOL’s Research Aviation Facility (RAF).
change note: 2018-05-23 11:36:11.0 [sritz] insert AltLabel (id: null category: primary text: NSF/NCAR Gulfstream GV Aircraft language code: en);
change note: 2018-05-23 11:35:22.0 [sritz] Insert Concept add broader relation (NSF/NCAR GV HIAPER [879d697c-381f-45df-a48d-2d9095bc5c54,367611] - Aircraft [227d9c3d-f631-402d-84ed-b8c5a562fc27,344663]);
change note: 2018-06-06 17:02:15.0 [sritz] insert WeightedRelation (id: null related concept uuid: 8f368c9f-5dd7-42f6-8cd1-086c23ef6cdd relationship type: null relationship value: null generated by: null);
change note: 2022-02-17 09:39:19.0 [tstevens] insert Definition (id: null text: The NSF/NCAR High-performance Instrumented Airborne Platform for Environmental Research (HIAPER) aircraft is the preeminent airborne research platform for scientists and researchers in several disciplines. HIAPER has demonstrated success in collecting data required to meet a broad range of scientific studies and objectives, including air quality and chemistry; chemical composition and transport within the atmosphere; effects of the chemical process on climate change; atmospheric dynamics and thermodynamics on the synoptic and mesoscales; cloud properties and processes; atmospheric predictability; geological surveys; and electrification of the atmosphere. In support of university-driven observational field campaigns, HIAPER is maintained and operated on behalf of the National Science Foundation by the National Center for Atmospheric Research. HIAPER is based in Broomfield, Colorado, USA, and is managed by EOL’s Research Aviation Facility (RAF). language code: en);
change note: 2021-11-17 13:34:13.0 [tstevens] Move Concepts delete broader relation (null); add broader relation (NSF/NCAR GV HIAPER [879d697c-381f-45df-a48d-2d9095bc5c54,826466] - Jet [5b8e4067-db4e-42d4-b4a5-7de5e683125d,835881]);
in scheme: platforms