PS2.SD
type: Concept
change note: 2021-04-22 15:14:32.0 [tstevens] insert AltLabel (id: null category: primary text: Dove-R language code: en); insert Definition (id: null text: The PS2.SD instrument is comprised of the same "PS2" telescope and the same 2D frame detector as used in PS2. The Bayer pattern filter and pass-band filters in the PS2 satellites have been replaced with a high-performance butcher-block filter. The PS2.SD filter is made up of 4 individual pass-band filters, that separate the light into each of the blue, green, red and NIR channels. The choice of the pass-band filters for PS2.SD match closely with and are interoperable with those of Sentinel-2. We’ve named this new instrument PS2.SD. language code: en);
change note: 2021-04-22 15:12:50.0 [tstevens] Insert Concept add broader relation (PS2.SD [87a3848a-9791-4039-8005-2692f3818762,578418] - Telescopes [7502f18e-f489-49f5-b879-27d5407df7ec,567147]);
in scheme: instruments
definition: The PS2.SD instrument is comprised of the same "PS2" telescope and the same 2D frame detector as used in PS2. The Bayer pattern filter and pass-band filters in the PS2 satellites have been replaced with a high-performance butcher-block filter. The PS2.SD filter is made up of 4 individual pass-band filters, that separate the light into each of the blue, green, red and NIR channels. The choice of the pass-band filters for PS2.SD match closely with and are interoperable with those of Sentinel-2. We’ve named this new instrument PS2.SD.

Telescopes
type: Concept