GELBSTOFF
type: Concept
in scheme: sciencekeywords
definition: Dissolved organic matter (DOM) produced by the decomposition of plant material and the metabolism of plankton, originating in the ocean or brought to the ocean by rivers, and producing a distinctive yellow-brown to yellow-red coloration of the water.

OCEAN OPTICS
type: Concept