K7
type: Concept
change note: 2014-01-08 09:07:30.0 [mpmorahan] insert AltLabel (id: null text: JAMSTEC-Kyoto University collaborative program language code: en);
change note: 2014-01-08 09:00:41.0 [mpmorahan] Insert Concept add broader relation (K7 [88827a39-e0e3-4567-af78-73c50c58e7ea,106089] - J - L [996e8a4b-e690-4a9c-afcf-205fff95b38b,77535]);
in scheme: projects
definition: JAMSTEC-Kyoto University collaborative program

J - L
type: Concept