MARSH
type: Concept
change note: 2013-04-01 08:48:16.0 [tbs1979] insert Definition (id: null text: Type of wetland, featuring grasses, rushes, reeds, typhas, sedges, and other herbaceous plants (possibly with low-growing woody plants) in a context of shallow water. language code: en);
change note: 2013-02-18 10:38:16.0 [tbs1979] Insert Concept add broader relation (MARSH [88adcca6-2bc8-443a-9f25-c9aded577615,82447] - FLUVIAL LANDFORMS [cb5193ab-2d7a-4b35-b7ec-f16ce78ae270,64131]);
in scheme: sciencekeywords
definition: Type of wetland, featuring grasses, rushes, reeds, typhas, sedges, and other herbaceous plants (possibly with low-growing woody plants) in a context of shallow water.

FLUVIAL LANDFORMS
type: Concept