MIDD-C
type: Concept
in scheme: providers
definition: Imagine yourself at Middlebury College, with four years to try new ideas and explore the subjects and pursuits you feel passionate about. Four years to explore a liberal arts curriculum so diverse and interdisciplinary that it would take over a century to experience it all. Four years to act in a student production, do research with faculty scientists, join a relief mission to a country halfway around the world, hike the Long Trail, or play left wing on the hockey team. Where would you start? No matter where you choose to begin, Middlebury offers abundant opportunities for learning and growth—and opens doors to the future you envision. Summary Provided By: http://www.middlebury.edu/admissions

ACADEMIC
type: Concept