AEROSOLS
type: Concept

ORGANIC PARTICLES
type: Concept
in scheme: sciencekeywords
definition: Aerosol particles consisting predominantly of organic compounds, mainly C, H, O, and lesser amounts of other elements: may be biogenic or anthropogenic; primary or secondary; some organic compounds in aerosols may exhibit substantial light absorption.