LAND HEAT CAPACITY
type: Concept
change note: 2013-08-16 09:21:37.0 [tbs1979] update Definition (Huschle, R.E., ed. 1959. Glossary of Meteorology, American Meteorological Society, Boston, MA. ); update Definition (The ratio of the heat absorbed (or released) by a system to the corresponding temperature rise (or fall).);
in scheme: sciencekeywords
definition: The ratio of the heat absorbed (or released) by a system to the corresponding temperature rise (or fall).

SURFACE THERMAL PROPERTIES
type: Concept