HydraProbe
type: Concept
change note: 2022-10-05 13:23:16.0 [tstevens] insert AltLabel (id: null category: primary text: Stevens Water HydraProbe language code: en); insert Definition (id: null text: The Stevens Water HydraProbe is a rugged soil sensor which measures three soil parameters: moisture, electrical conductivity and temperature. language code: en);
change note: 2022-10-05 13:22:25.0 [tstevens] Insert Concept add broader relation (HydraProbe [893d780c-68d0-44b1-8fde-f51f881ed2ef,1070174] - Probes [def72d78-3c2f-4f46-91e7-259a0e63e2de,1062496]);
in scheme: instruments
definition: The Stevens Water HydraProbe is a rugged soil sensor which measures three soil parameters: moisture, electrical conductivity and temperature.

Probes
type: Concept