Surface
type: Concept

R/V Thompson
type: Concept
in scheme: platforms
change note: 2020-08-12 15:00:16.0 [sritz] insert AltLabel (id: null category: primary text: Research Vessel Thomas G. Thompson language code: en);
change note: 2021-11-18 09:21:26.0 [tstevens] Move Concepts delete broader relation (null); add broader relation (R/V Thompson [896d7c41-6ddc-4a23-acc4-ee946cf32a7f,826475] - Surface [59b97a6c-385e-40a2-8422-ecbdb6023c4c,835900]);
change note: 2020-08-12 14:59:10.0 [sritz] insert Definition (id: null text: Research Vessel (R/V) Thomas G. Thompson is owned by the U.S. Navy Ofﬁce of Naval Research and is operated by the School of Oceanography at the University of Washington as part of the University National Oceanographic Laboratories System (UNOLS) fleet . language code: en);
change note: 2020-08-12 14:58:09.0 [sritz] Insert Concept add broader relation (R/V Thompson [896d7c41-6ddc-4a23-acc4-ee946cf32a7f,560588] - SHIPS [82a67b12-e99d-4c90-8a6a-a6f79d4c3c7b,542079]);
definition: Research Vessel (R/V) Thomas G. Thompson is owned by the U.S. Navy Ofﬁce of Naval Research and is operated by the School of Oceanography at the University of Washington as part of the University National Oceanographic Laboratories System (UNOLS) fleet .