Cameras
type: Concept

PVI
type: Concept
change note: 2014-06-17 21:31:59.0 [saritz] insert AltLabel (id: null text: Precipitation Video Imager language code: en);
change note: 2014-06-17 21:31:30.0 [saritz] insert Definition (id: null text: PVI is an instrument designed by Dr. Larry Bliven at NASA Wallops Flight Facility. Its high-frame-rate records of grey-scale images is able to determine particle size in both rain and snow. A description of PVI, also called Snowflake Video Imager, is documented in Newman, A.J., Kucera, P.A. and Bliven, L.F. 2009. 'Presenting the Snowflake Video Imager (SVI).' Journal of Atmospheric and Ocean Technology, 26, pp 167-179. language code: en);
change note: 2014-06-17 21:30:42.0 [saritz] Insert Concept add broader relation (PVI [899b268d-9cdb-4215-af8b-b29b9d7c20f7,106477] - Cameras [d322ae9d-bde0-448f-948d-777aef096eb6,75167]);
in scheme: instruments
definition: PVI is an instrument designed by Dr. Larry Bliven at NASA Wallops Flight Facility. Its high-frame-rate records of grey-scale images is able to determine particle size in both rain and snow. A description of PVI, also called Snowflake Video Imager, is documented in Newman, A.J., Kucera, P.A. and Bliven, L.F. 2009. 'Presenting the Snowflake Video Imager (SVI).' Journal of Atmospheric and Ocean Technology, 26, pp 167-179. Group: Instrument_Details Entry_ID: PVI Group: Instrument_Identification Instrument_Category: Earth Remote Sensing Instruments Instrument_Class: Passive Remote Sensing Instrument_Type: Photon/Optical Detectors Instrument_Subtype: Cameras Short_Name: PVI End_Group Creation_Date: 2014-06-17 End_Group