Earth Observation Satellites
type: Concept

PAZ
type: Concept
change note: 2020-06-25 12:01:30.0 [mmorahan]
change note: 2020-06-25 13:04:56.0 [mmorahan] update Definition (https://directory.eoportal.org/web/eoportal/satellite-missions/p/paz); insert WeightedRelation (id: null related concept uuid: 474a09e5-315c-42e4-9521-36153eafb049 relationship type: null relationship value: null generated by: null);
change note: 2020-06-25 12:03:49.0 [mmorahan] update AltLabel (SAR Observation Spanish Satellite);
change note: 2020-06-25 11:09:18.0 [mmorahan] insert AltLabel (id: null category: primary text: Peace language code: en); insert Definition (id: null text: PAZ ("peace" in Spanish) is an X-band SAR (Synthetic Aperture Radar) spacecraft based on the TerraSAR-X platform, to serve the security and the defense needs of Spain. The PAZ mission is a dual-use mission (civil/defense) funded and owned by the Spanish Ministry of Defense and managed by Hisdesat. language code: en);
change note: 2021-11-18 12:51:05.0 [tstevens] Move Concepts delete broader relation (null); add broader relation (PAZ [8ac70aba-53e7-45c0-8b4a-2c0197114b09,826480] - Earth Observation Satellites [3466eed1-2fbb-49bf-ab0b-dc08731d502b,826121]);
change note: 2021-11-18 12:46:06.0 [tstevens] Move Concepts delete broader relation (null); add broader relation (PAZ [8ac70aba-53e7-45c0-8b4a-2c0197114b09,826480] - Space-based Platforms [b39a69b4-c3b9-4a94-b296-bbbbe5e4c847,835875]);
change note: 2020-06-25 11:07:23.0 [mmorahan] Insert Concept add broader relation (PAZ [8ac70aba-53e7-45c0-8b4a-2c0197114b09,560494] - Earth Observation Satellites [3466eed1-2fbb-49bf-ab0b-dc08731d502b,541501]);
definition: PAZ ("peace" in Spanish) is an X-band SAR (Synthetic Aperture Radar) spacecraft based on the TerraSAR-X platform, to serve the security and the defense needs of Spain. The PAZ mission is a dual-use mission (civil/defense) funded and owned by the Spanish Ministry of Defense and managed by Hisdesat.
in scheme: platforms