SGP00
type: Concept
in scheme: projects
definition: The Southern Great Plains 2000 Hydrology Experiment involves the demonstration of the viability of L-band radiometry for remotely sensing surface moisture. Many geophysical variables, global measurements and interpretations of soil moisture might be best accomplished by a combination of spaceborne and ground-based techniques. This is the main objective of this project. Read the plan document at "http://hydrolab.arsusda.gov/sgp97/sgp97final.pdf" [Sumary taken from Souther Great Plains 1997 Experiment Report]

S - U
type: Concept