ENERGY PRODUCTION/USE
type: Concept

SOLAR ENERGY PRODUCTION/USE
type: Concept
change note: 2012-06-29 13:54:57.0 [tbs1979] insert Definition (id: null text: Refers to the production and use of solar energy for human consumption. Solar energy is energy from the sun that is converted into thermal or electrical energy. language code: en);
change note: 2012-06-26 15:44:23.0 [tbs1979] Insert Concept add broader relation (SOLAR ENERGY PRODUCTION/USE [8b4f34c1-7aed-4833-811a-401382abd17c,40117] - ENERGY PRODUCTION/USE [b73cee46-8e2c-4df9-b1ed-7f0aa98a04ac,40101]);
in scheme: sciencekeywords
definition: Refers to the production and use of solar energy for human consumption. Solar energy is energy from the sun that is converted into thermal or electrical energy.