Jet
type: Concept

Airplane
type: Concept
change note: 2022-04-01 08:46:13.0 [tstevens] Insert Concept add broader relation (Airplane [8b7834c1-2c66-414e-a655-2298e7dcc479,879789] - Jet [5b8e4067-db4e-42d4-b4a5-7de5e683125d,870056]);
change note: 2022-04-01 08:47:07.0 [tstevens] insert AltLabel (id: null category: primary text: Airplane language code: en);
change note: 2022-04-01 08:49:48.0 [tstevens] insert Definition (id: null text: A fixed-wing aircraft that is propelled forward by thrust from a jet engine, propeller, or rocket engine. language code: en);
in scheme: platforms
definition: A fixed-wing aircraft that is propelled forward by thrust from a jet engine, propeller, or rocket engine.