A - C
type: Concept

CAVIAR
type: Concept
in scheme: projects
definition: Short Title: CAVIAR Project URL: http://www.arcticcentre.org/caviar Proposal URL: http://classic.ipy.org/development/eoi/proposal-details.php?id=157 Problem & Rationale The Arctic is currently undergoing rapid social and environmental changes, and the cumulative effects are felt across the region. The rapidity and pervasiveness of these changes continue to present challenges to the adaptive capacity for local communities and Arctic societies (ACIA 2005, AHDR 2004). Local responses to these challenges will depend, in part, on the vulnerability and adaptive capacity of human-environment systems, where vulnerability describes the degree to which a system is likely to experience harm due to exposure to a hazard, either a perturbation or a stress, and adaptation refers to change in a system in response to some force or perturbation. Yet, the processes that shape vulnerability and adaptive capacity are not well understood. The aim of this project is to develop and apply methods for assessing the vulnerability and adaptive capacity of human systems in local Arctic communities. This analysis will enable comparison of local communities experiencing (or expected to experience) rapid and cumulative changes under different internal and external conditions. Project results will also indicate areas or actions for improving resilience. Research Objectives The research will enhance empirical and theoretical understanding of processes that shape vulnerability and adaptation across the circumpolar region by 1. further developing the theoretical concept of vulnerability (Turner et al, 2003; Smit and Pilifosova, 2003) and refining and applying an interdisciplinary research methodology for vulnerability studies (ie. Huq and Lim, 2005; Keskitalo, 2004; Ford and Smit, 2004) 2. identifying social and environmental factors and stresses and document the interactions which shape adaptive capacity and vulnerability. 3. improving understanding of the interrelations between local vulnerability a…