GLACIAL LANDFORMS
type: Concept

GLACIAL HORNS
type: Concept
change note: 2013-08-26 08:19:19.0 [tbs1979] insert Definition (id: null text: A sharp peak formed where the ridges separating three or more cirques intersect. language code: en);
change note: 2013-08-06 14:40:25.0 [tbs1979] Insert Concept add broader relation (GLACIAL HORNS [8c878cc0-d601-4371-af35-9db2c67d8de6,105611] - GLACIAL LANDFORMS [b895f4b5-5273-49ef-883f-b67d9f199505,105287]);
in scheme: sciencekeywords
definition: A sharp peak formed where the ridges separating three or more cirques intersect.