USDA/ERS/ESS
type: Concept
in scheme: providers
definition: The USDA Economics and Statistics System contains nearly 300 reports and datasets from the economics agencies of the U.S. Department of Agriculture. These materials cover U.S. and international agriculture and related topics. Most reports are text files that contain time-sensitive information. Most data sets are in spreadsheet format and include time-series data that are updated yearly. See help for more introductory system information. Website: "http://usda.mannlib.cornell.edu/" [Summary provided by the USDA.]

USDA
type: Concept