HEALTH ADVISORIES
type: Concept

DISEASE/EPIDEMIC
type: Concept
in scheme: sciencekeywords
definition: A report pertaining information on the presence and rapid/extensive spread of a pathological condition of a part, organ, or system of an organism resulting from various causes, such as infection, genetic defect, or environmental stress, which is characterized by an identifiable group of signs or symptoms.