Profilers/Sounders
type: Concept

SBUS
type: Concept
in scheme: instruments
definition: UV ozone sounding instrument for 12-port, these channels observation data together, you can generate ozone vertical profile of the product.Use ozone vertical profile of the product, you can monitor a different level of ozone levels to protect the Earth's atmospheric ozone layer providing early-warning information, provide for protection policies. Atmospheric model spectral properties of the instrument Channel Central wavelength(nm) Bandwidth(nm) 1 252.00±0.05 1+0.2，-0 2 273.62±0.05 1+0.2，-0 3 283.10±0.05 1+0.2，-0 4 287.70±0.05 1+0.2，-0 5 292.29±0.05 1+0.2，-0 6 297.59±0.05 1+0.2，-0 7 301.97±0.05 1+0.2，-0 8 305.87±0.05 1+0.2，-0 9 312.57±0.05 1+0.2，-0 10 317.56±0.05 1+0.2，-0 11 331.26±0.05 1+0.2，-0 12 339.89±0.05 1+0.2，-0 Cloud cover photometer 379.00±1.00 3+0.3 Group: Instrument_Details Entry_ID: SBUS Group: Instrument_Identification Instrument_Category: Earth Remote Sensing Instruments Instrument_Class: Passive Remote Sensing Instrument_Type: Profilers/Sounders Short_Name: SBUS Long_Name: Solar Backscatter Ultraviolet Sounder End_Group Online_Resource: http://satellite.cma.gov.cn/ArssEn/StaticContent/DeviceIntro_FY3_SBUS.aspx Online_Resource: http://satellite.cma.gov.cn/ArssEn/Ord/Satellite.aspx?seriesCode=FY3X&satellitecode=FY3A Creation_Date: 2011-02-01 Group: Instrument_Logistics Instrument_Start_Date: 2008-05-29 Instrument_Owner: China/NSMC End_Group End_Group