CVOU-O/ICBM
type: Concept
change note: 2012-07-30 14:25:59.0 [aaleman] Insert Concept add broader relation (CVOU-O/ICBM [8ce38e87-60b6-4612-b19d-8001711d9585,40409] - ACADEMIC [7700280b-68ee-4644-bf5e-84e7a6adf897,24357]);
in scheme: providers
definition: The scientific concept of the Institute is based on the recognition that the Exploration of the Seas, one of the most diverse global systems promises success only with interdisciplinary methods. A comprehensive understanding of the marine habitats as hubs for the development of the earth requires complex interdisciplinary science work. The research focus of the institute can be subdivided into the following areas: • mathematical and scientific principles, research and global ecology, • applied environmental research in marine ecosystems and climate systems, • development of marine technologies. [Translated summary provided by the Institute for Chemistry and Biology of the Marine Environment (ICBM)]

ACADEMIC
type: Concept