LAND SURFACE/AGRICULTURE INDICATORS
type: Concept

VEGETATION COVER
type: Concept
change note: 2012-07-18 18:41:24.0 [mpmorahan] insert Definition (id: null text: Vegetation Cover is the percent of vegetation in an area. language code: en);
change note: 2012-06-26 12:16:11.0 [gee-cee] Insert Concept add broader relation (VEGETATION COVER [8d1157c4-d36b-40db-aa82-3603716f9988,39867] - LAND SURFACE/AGRICULTURE INDICATORS [112e71ec-c0a1-49a8-82d7-bcb317b45860,39835]);
in scheme: sciencekeywords
definition: Vegetation Cover is the percent of vegetation in an area.