COASTAL
type: Concept

DUNES
type: Concept
change note: 2016-06-13 13:03:30.0 [gee-cee] Move Concepts delete broader relation (null); add broader relation (DUNES [8d38de3b-2d05-4ad2-a960-f47a66191319,85425] - COASTAL HABITAT [47be68db-d10d-43e7-b150-61cfd3f06126,84259]);
change note: 2016-06-13 13:05:33.0 [gee-cee] Move Concepts delete broader relation (null); add broader relation (DUNES [8d38de3b-2d05-4ad2-a960-f47a66191319,85425] - COASTAL HABITAT [47be68db-d10d-43e7-b150-61cfd3f06126,84259]);
change note: 2016-06-13 13:03:40.0 [gee-cee] undo move delete broader relation (null); add broader relation (DUNES [8d38de3b-2d05-4ad2-a960-f47a66191319,85425] - TERRESTRIAL ECOSYSTEMS [9361962c-cfc7-4428-8843-b3502718c382,83509]);
change note: 2016-06-13 13:52:32.0 [gee-cee] update Definition (Mounds, ridges, or hills of wind-blown sand, either bare or covered with vegetation.); update Definition (Dictionary of Geological Terms, American Geological Institute, 1984. );
in scheme: sciencekeywords
definition: Mounds, ridges, or hills of wind-blown sand, either bare or covered with vegetation.