Maps
type: Concept

MAPS
type: Concept
change note: 2021-11-30 12:42:45.0 [tstevens] Move Concepts delete broader relation (null); add broader relation (MAPS [8d56ab86-f13a-423b-b209-eca2baeb73ee,826495] - Maps [d53da93a-cc40-457a-a708-6bd4eeb1ffc1,835910]);
change note: 2021-07-23 17:02:43.0 [sritz] insert AltLabel (id: null category: primary text: MAPS language code: en); update Resource (image);
change note: 2022-03-08 15:19:46.0 [tstevens] delete Resource (null);
change note: 2022-03-09 09:49:27.0 [tstevens] update Definition (A Map is a graphic representation of the Earth's surface. Maps can include street maps, world maps, country maps, state maps, historic maps and world maps.); update Definition (About Geography);
in scheme: platforms
definition: A Map is a graphic representation of the Earth's surface. Maps can include street maps, world maps, country maps, state maps, historic maps and world maps.