V - Z
type: Concept

VIRGAS
type: Concept
change note: 2021-05-18 15:24:34.0 [sritz] Insert Concept add broader relation (VIRGAS [8d727e0e-59be-4970-bfd3-6bfa1033cbe6,621139] - V - Z [c8e3dd70-6b82-4034-9e23-b892b302d8b4,615646]);
change note: 2021-05-18 15:26:14.0 [sritz] insert Definition (id: null text: The objective of the Volcano-plume Investigation Readiness and Gas-phase and Aerosol Sulfur (VIRGAS) field experiment is to understand how natural and human-caused emissions of sulfur species, for example from volcanoes and from fossil-fuel power sources, ultimately influence climate, air quality, and visibility. language code: en);
change note: 2021-05-18 15:25:16.0 [sritz] insert AltLabel (id: null category: primary text: Volcano-plume Investigation Readiness and Gas-phase and Aerosol Sulfur language code: en);
in scheme: projects
definition: The objective of the Volcano-plume Investigation Readiness and Gas-phase and Aerosol Sulfur (VIRGAS) field experiment is to understand how natural and human-caused emissions of sulfur species, for example from volcanoes and from fossil-fuel power sources, ultimately influence climate, air quality, and visibility.