PRESCRIBED BURNS
type: Concept
in scheme: sciencekeywords
definition: The act of intentionally setting fire to an area in order to prevent more damaging fires. A Prescribed Burn Advisory may report on a prescribe burn.

FIRE ADVISORIES
type: Concept