DROPLET GROWTH
type: Concept

AGGREGATION
type: Concept
change note: 2013-03-21 14:52:25.0 [mpmorahan] insert Definition (id: null text: The process of combining different surface characteristics from neighboring heterogeneous regions into an average value for the area. It is used in boundary layer studies for surface fluxes, drag, and roughness. This process is often necessary to define surface characteristics for numerical models that have coarse horizontal grid mesh and that cannot resolve the individual surface areas. The process of clumping together of snow crystals following collision as they fall to form snowflakes. This process is especially important near the melting layer where snow particles stick to each other more easily because of the liquid water on the surface. It also occurs at lower temperatures especially between dendritic snow crystals and occasionally rosette crystals in cirrus. language code: en);
change note: 2013-02-14 14:52:37.0 [mpmorahan] Insert Concept add broader relation (AGGREGATION [8e484ec4-50fd-4c08-9c96-6ad483e170ad,82317] - DROPLET GROWTH [63effad4-4323-486d-a81b-e0bf3264e5c9,82309]);
in scheme: sciencekeywords
definition: The process of combining different surface characteristics from neighboring heterogeneous regions into an average value for the area. It is used in boundary layer studies for surface fluxes, drag, and roughness. This process is often necessary to define surface characteristics for numerical models that have coarse horizontal grid mesh and that cannot resolve the individual surface areas. The process of clumping together of snow crystals following collision as they fall to form snowflakes. This process is especially important near the melting layer where snow particles stick to each other more easily because of the liquid water on the surface. It also occurs at lower temperatures especially between dendritic snow crystals and occasionally rosette crystals in cirrus.