BIOAVAILABILITY
type: Concept
in scheme: sciencekeywords
definition: The degree and rate at which a substance is absorbed into a living system or is made available at the site of physiological activity.

ECOTOXICOLOGY
type: Concept