COLUMBIA/LDEO/IRI/CDL
type: Concept
in scheme: providers
definition: The IRI/LDEO Climate Data Library contains over 300 datasets from a variety of earth science disciplines and climate-related topics. The library allows users to: 1. access any number of datasets 2. create analyses of data ranging from simple averaging to more advanced EOF analyses 3. monitor present climate conditions with maps and analyses in the Maproom; 4. create visual representations of data, including animations 5. download data in a variety of commonly-used formats, including GIS-compatible formats Website: "http://ingrid.ldeo.columbia.edu/" [Summary provided by Columbia University.]

ACADEMIC
type: Concept