MARINE
type: Concept
in scheme: sciencekeywords
definition: Marine Wetlands are areas that are sometimes covered with water and sometimes dry, being influenced by marine water level and tidal fluctuations.

WETLANDS
type: Concept