FLUVIAL LANDFORMS
type: Concept

SWAMP
type: Concept
change note: 2017-03-15 11:53:28.0 [mgenazzi] Definition updated update Definition (An area of land that is always soaked with water; low, wet land that supports grass and trees. Swamps are wet areas that are normally covered by water all year and subject to drying out during the summer. The parameter Swamp may be colloquially interchanged with the parameter Marshes.);
change note: 2013-08-15 13:16:27.0 [tbs1979] insert Definition (id: null text: An area of land that is always soaked with water; low, wet land that supports grass and trees. language code: en);
change note: 2013-08-05 12:39:11.0 [tbs1979] Insert Concept add broader relation (SWAMP [8f6adff6-672d-4066-8c85-25418a7d0e00,105341] - FLUVIAL LANDFORMS [bdc0bd86-a3a3-48fa-b1fb-4ca5d13d4dde,105281]);
in scheme: sciencekeywords
definition: An area of land that is always soaked with water; low, wet land that supports grass and trees. Swamps are wet areas that are normally covered by water all year and subject to drying out during the summer. The parameter Swamp may be colloquially interchanged with the parameter Marshes.