Surface
type: Concept

R/V AA
type: Concept
change note: 2022-02-22 14:50:40.0 [tstevens] insert Definition (id: null text: An Australian icebreaker that was built by Carrington Slipways and launched in 1989. The vessel is owned by P&O Maritime Services. It was regularly chartered by the Australian Antarctic Division (AAD) for research cruises in Antarctic waters and to support Australian bases in Antarctica. language code: en);
change note: 2021-11-18 09:31:56.0 [tstevens] Move Concepts delete broader relation (null); add broader relation (R/V AA [90fadab8-daa5-4725-9e58-8fa81f05a960,826504] - Surface [59b97a6c-385e-40a2-8422-ecbdb6023c4c,835900]);
in scheme: platforms
definition: An Australian icebreaker that was built by Carrington Slipways and launched in 1989. The vessel is owned by P&O Maritime Services. It was regularly chartered by the Australian Antarctic Division (AAD) for research cruises in Antarctic waters and to support Australian bases in Antarctica.