CONTAMINANT LEVELS/SPILLS
type: Concept
change note: 2012-06-29 14:38:08.0 [tbs1979] update Definition (A measurement of the frequency of contaminant spills in the environment and whether the contaminant spills is hazardous to a population. Measuring the level of contaminants in the environment will determine if there is a hazard to a population.); update Definition (Princeton University Dictionary);
change note: 2012-06-27 13:59:20.0 [tbs1979] update PrefLabel (CONTAMINANT LEVELS/SPILLS);
in scheme: sciencekeywords
definition: A measurement of the frequency of contaminant spills in the environment and whether the contaminant spills is hazardous to a population. Measuring the level of contaminants in the environment will determine if there is a hazard to a population.

ENVIRONMENTAL IMPACTS
type: Concept