WIND STRESS
type: Concept
in scheme: sciencekeywords
definition: The drag or tangential foce per unit area exerted upon the earth's surface by moving air in the surface boundary layer.

OCEAN WINDS
type: Concept