CONSORTIA/INSTITUTIONS
type: Concept

EAWAG
type: Concept
change note: 2013-08-13 11:27:57.0 [tbs1979] insert AltLabel (id: null text: EAWAG Aquatic Research Institute language code: en);
change note: 2013-08-13 11:26:55.0 [tbs1979] Insert Concept add broader relation (EAWAG [9231efce-0fc0-472c-a633-bb05a7b66b52,105715] - CONSORTIA/INSTITUTIONS [aef2fc80-def0-46a4-9259-9dc37e80ed08,66451]);
in scheme: providers
definition: Eawag is a world-leading aquatic research institute. Its research, which is driven by the needs of society, provides the basis for innovative approaches and technologies in the water sector. Through close collaboration with experts from industry, government and professional associations, Eawag plays an important bridging role between theory and practice, allowing new scientific insights to be rapidly implemented.