CA/RA/CERES
type: Concept
in scheme: providers
definition: The California Environmental Resources Evaluation System (CERES) is an information system developed by the California Resources Agency to facilitate access to a variety of electronic data describing California's rich and diverse environments. The goal of CERES is to improve environmental analysis and planning by integrating natural and cultural resource information from multiple contributors and by making it available and useful to a wide variety of users. Website: http://ceres.ca.gov/ [Summary provided by CERES.]

CALIFORNIA
type: Concept