SUBSURFACE FLOW
type: Concept

AVERAGE FLOW
type: Concept
change note: 2016-03-31 10:53:31.0 [gee-cee] insert Definition (id: null text: Average amount of water flowing through a point in the stream per second. language code: en);
change note: 2016-03-31 10:53:08.0 [gee-cee] Insert Concept add broader relation (AVERAGE FLOW [92bfc132-bc15-4952-99a7-763f109c1e7e,158815] - SUBSURFACE FLOW [872a0464-884c-4d6f-8f06-0679329dadcc,158813]);
in scheme: sciencekeywords
definition: Average amount of water flowing through a point in the stream per second.