UMN/MPC
type: Concept
change note: 2015-09-17 12:38:35.0 [tbs1979] insert AltLabel (id: null text: Minnesota Population Center, University of Minnesota language code: en);
change note: 2015-09-17 12:37:38.0 [tbs1979] Insert Concept add broader relation (UMN/MPC [92cc0561-e6f2-4b66-a57a-c6e9cfbddffd,158405] - ACADEMIC [7700280b-68ee-4644-bf5e-84e7a6adf897,135979]);
in scheme: providers
definition: The Minnesota Population Center (MPC) is a University-wide interdisciplinary cooperative for demographic research. The MPC serves more than 80 faculty members and research scientists from eight colleges and institutes at the University of Minnesota. As a leading developer and disseminator of demographic data, we also serve a broader audience of some 60,000 demographic researchers worldwide.

ACADEMIC
type: Concept