GMPP
type: Concept
in scheme: projects
definition: The GMPP (Geological Mapping of Potter Penninsula)involves a study of the Potter Peninsula in Antarctica. It involved the collection of geologic, topographic, and hydrologic data for use in maps and 3-d modeling. Work on this project started in 1999.

G - I
type: Concept