MULTINATIONAL ORGANIZATIONS
type: Concept

EEA
type: Concept
in scheme: providers
definition: The goal of the European Environment Agency is to support sustainable development and to help achieve significant and measurable improvement in Europe's environment through the provision of timely, targeted, relevant and reliable information to policy making agents and the public. [Summary provided by the European Environment Agency.]