AIR QUALITY
type: Concept

VISIBILITY
type: Concept
in scheme: sciencekeywords
definition: The greatest distance from an observer that a prominent object of known characteristics can be seen and unidentified by unaided, normal eyes.