LUSTER
type: Concept
change note: 2013-03-14 14:28:46.0 [tbs1979] insert Definition (id: null text: Rock luster is the way light reflects off the surface of a mineral. language code: en);
change note: 2013-03-05 12:33:11.0 [tbs1979] Insert Concept add broader relation (LUSTER [93aee4f9-2bcc-4208-b538-0c92f1ac1f42,82989] - METAMORPHIC ROCK PHYSICAL/OPTICAL PROPERTIES [2d38e7c6-8169-49e9-ab9d-0d0f690cce04,82971]);
in scheme: sciencekeywords
definition: Rock luster is the way light reflects off the surface of a mineral.

METAMORPHIC ROCK PHYSICAL/OPTICAL PROPERTIES
type: Concept