BPUCJRI
type: Concept
in scheme: projects
definition: The Project finalized in 2004 and will be continued by the Project PICTA-17-2004 (years 2004-2007) The project work comprises the study of the Gustav Group exposed on James Ross Island and consists of the following phases: 1. Bed-by-bed collecting of macrofossils and samples for microfossil processing. 2. Systematic study of the ... macrofauna collected. 3. Definition and characterization of biostratigraphical zones. 4. Correlation of the Antarctic sequences with other sections in the Southern Hemisphere, in particular with Patagonia. 5. Biogeographical, palaeoecological and paleoenvironmental interpretation. En Espanol: Este proyecto finaliza en el ano 2004 y continuara con el Proyecto PICTA-17-2004 (anos 2004-2007) Proyecto Bioestratigrafia y Paleontologia del Cretacico superior de la Isla James: Este Proyecto se propone realizar investigaciones en el Cretacico superior de la Isla James Ross. Se trata de analizar la sucesion estratigrafica, la paleontologia unidades y la bioestratigrafia del Grupo Gustav. Esto podra establecer una correlacion mas precisa entre las mismas y con las unidades de Cuenca Austral y con otras del Hemisferio Austral. Los resultados de estas investigaciones contribuiran a llenar un vacio de conocimiento geologico y bioestratigrafico. Tambien se contempla la realizacion de Trabajos Finales de Licenciatura de alumnos de la Universidad de Buenos Aires, contribuyendo a la formacion y capacitacion de futuros profesionales.

A - C
type: Concept