WLDAS
type: Concept
change note: 2023-04-17 07:36:01.0 [tstevens] insert AltLabel (id: null category: primary text: Western Land Data Assimilation System language code: en); insert Definition (id: null text: "WLDAS is a custom instance of LIS and leverages previous LDAS development efforts including the Global Land Data Assimilation System, the North American Land Data Assimilation System, the Famine Early Warning Systems Network Land Data Assimilation System, the U.S. Air Force 557th Weather Wing LDAS, and the National Climate Assessment Land Data Assimilation System." "WLDAS was recently developed to provide hydrological information for the western United States, where such information is highly valued due to the limited availability of both water and water data." language code: en);
change note: 2023-04-17 07:33:02.0 [tstevens] Insert Concept add broader relation (WLDAS [953f0c59-0d9a-469b-af67-01fb8cd0d5bc,1291331] - V - Z [c8e3dd70-6b82-4034-9e23-b892b302d8b4,1285492]);
in scheme: projects
definition: "WLDAS is a custom instance of LIS and leverages previous LDAS development efforts including the Global Land Data Assimilation System, the North American Land Data Assimilation System, the Famine Early Warning Systems Network Land Data Assimilation System, the U.S. Air Force 557th Weather Wing LDAS, and the National Climate Assessment Land Data Assimilation System." "WLDAS was recently developed to provide hydrological information for the western United States, where such information is highly valued due to the limited availability of both water and water data."

V - Z
type: Concept