P - R
type: Concept

PROVE
type: Concept
change note: 2017-06-14 15:46:57.0 [sritz] update Definition (The Prototype Validation Exercise (PROVE) was a mini field campaign conducted in May 1997. Three different NASA Earth Observing System (EOS) instrument teams were involved: MODIS (Moderate-resolution Imaging Spectrometer), MISR (Multi-angle Imaging Spectro Radiometer), and ASTER (Advanced Space-borne Thermal Emission and Reflectance Radiometer). Coordinated field, aircraft, and satellite measurements were designed to maximize data collection and conduct cross comparisons. The 1997 campaigns were conducted in a grassland-shrub site on the Jornada Experimental Range near Las Cruces, New Mexico, and in a deciduous forest on the Walker Branch Watershed site near Oak Ridge, Tennessee.);
change note: 2017-06-07 10:37:01.0 [tstevens] update AltLabel (Prototype Validation Exercise);
in scheme: projects
definition: The Prototype Validation Exercise (PROVE) was a mini field campaign conducted in May 1997. Three different NASA Earth Observing System (EOS) instrument teams were involved: MODIS (Moderate-resolution Imaging Spectrometer), MISR (Multi-angle Imaging Spectro Radiometer), and ASTER (Advanced Space-borne Thermal Emission and Reflectance Radiometer). Coordinated field, aircraft, and satellite measurements were designed to maximize data collection and conduct cross comparisons. The 1997 campaigns were conducted in a grassland-shrub site on the Jornada Experimental Range near Las Cruces, New Mexico, and in a deciduous forest on the Walker Branch Watershed site near Oak Ridge, Tennessee.