RADAR
type: Concept

RADAR CROSS-SECTION
type: Concept
in scheme: sciencekeywords
definition: Measure of radar reflectivity, expressed in terms of the physical size of a hypothetical, uniformly scattering sphere that would give rise to the same level of reflection as that observed from the sample target.